{"text_format":"1","workbook":"xlsx","n_sheets":3,"sheets":["Summary","Mileage","Dropdown"],"not_rendered":{"charts":0,"images":1,"macros":1,"external_links":0,"defined_names":5,"comments":0,"pivot_tables":0},"unopened":[],"bounds":{"document_bytes":16777216,"sheet_cells":100000,"rows_first":2000,"rows_last":500,"rows_between":2000,"halvings":0,"cell_chars":16384,"cell_head_chars":4096},"cells_cut":0,"cells_raw":0,"read":"whole","date_system":"1900"}

{"sheet":"Summary","index":0,"n_rows":27,"n_cols":6,"rows_kept":27,"cut":false,"hidden":false,"merged":[[0,7,0,8],[3,1,3,2],[4,1,4,2],[5,1,5,2],[7,1,7,2],[0,3,0,5],[1,3,1,5],[18,3,18,5],[19,3,19,5],[14,11,15,12],[3,3,3,5],[4,3,4,5],[7,3,7,5],[5,3,5,5],[13,3,13,5],[14,3,14,5],[6,3,6,5],[15,4,15,5],[16,4,16,5]]}
[null,null,null,"TRAV-207\nSummary for Mileage Reimbursement"]
[null,null,null,"Revised: 8/20/2024"]
[]
[null,"Employee Name"]
[null,"Title"]
[null,"Official Station / Dept."]
[null,"Home Address"]
[null,"License Number"]
[]
[]
[]
[]
[]
[]
[null,null,null,"Travel Dates"]
[null,null,null,"Period beginning"]
[null,null,null,"Period ending"]
[]
[null,null,null,"Expense Type"]
[]
[]
[null,null,null,"Rate Per Mile",0.52]
[null,null,null,"Total Mileage",{"$f":"SUM(Mileage!J9:J301)","v":0}]
[null,null,null,"Total Reimbursement",{"$f":"SUM(Mileage!K9:K301)","v":0}]
[]
[null,"Driving Tag","Cost Center","REEport (AES Only)","Mileage","Expense"]
[null,null,null,null,null,0]

{"sheet":"Mileage","index":1,"n_rows":301,"n_cols":11,"rows_kept":301,"cut":false,"hidden":false,"merged":[[0,8,0,9],[0,3,0,6],[2,5,2,6],[3,5,3,6],[4,5,4,6],[2,1,2,2],[3,1,3,2],[4,1,4,2],[2,3,2,4],[3,3,3,4],[4,3,4,4]]}
[null,null,null,"Mileage Reimbursement Log",null,null,null,null,"TRAV-207"]
[]
[null,"Employee Name",null,{"$f":"IF(Summary!$D4=\"\",\"\",Summary!$D4)","v":""},null,"Rate Per Mile",null,0.52]
[null,"Official Station/Dept",null,{"$f":"IF(Summary!$D6=\"\",\"\",Summary!$D6)","v":""},null,"Total Mileage",null,{"$f":"SUM(J9:J301)","v":0}]
[null,"Period Ending",null,{"$f":"IF(Summary!$E17=\"\",\"\",Summary!$E17)","v":""},null,"Total Reimbursement",null,{"$f":"SUM(K9:K301)","v":0}]
[]
[null,null,null,null,null,"."]
["Date","Driving Tag","Cost Center","REEport (AES Only)","Purpose of Trip","From Location","Departure Time","To Location","Arrival Time","Mileage","Expense"]
[null,null,null,null,null,null,null,null,null,null,{"$f":"SUM(Mileage[[#This Row],[Mileage]]*H3)","v":0}]
[null,null,null,null,null,null,null,null,null,null,{"$f":"SUM(Mileage[[#This Row],[Mileage]]*H3)","v":0}]
[null,null,null,null,null,null,null,null,null,null,{"$f":"SUM(Mileage[[#This Row],[Mileage]]*H3)","v":0}]
[null,null,null,null,null,null,null,null,null,null,{"$f":"SUM(Mileage[[#This Row],[Mileage]]*H3)","v":0}]
[null,null,null,null,null,null,null,null,null,null,{"$f":"SUM(Mileage[[#This Row],[Mileage]]*H3)","v":0}]
[null,null,null,null,null,null,null,null,null,null,{"$f":"SUM(Mileage[[#This Row],[Mileage]]*H3)","v":0}]
[null,null,null,null,null,null,null,null,null,null,{"$f":"SUM(Mileage[[#This Row],[Mileage]]*H3)","v":0}]
[null,null,null,null,null,null,null,null,null,null,{"$f":"SUM(Mileage[[#This Row],[Mileage]]*H3)","v":0}]
[null,null,null,null,null,null,null,null,null,null,{"$f":"SUM(Mileage[[#This Row],[Mileage]]*H3)","v":0}]
[null,null,null,null,null,null,null,null,null,null,{"$f":"SUM(Mileage[[#This Row],[Mileage]]*H3)","v":0}]
[null,null,null,null,null,null,null,null,null,null,{"$f":"SUM(Mileage[[#This Row],[Mileage]]*H3)","v":0}]
[null,null,null,null,null,null,null,null,null,null,{"$f":"SUM(Mileage[[#This Row],[Mileage]]*H3)","v":0}]
[null,null,null,null,null,null,null,null,null,null,{"$f":"SUM(Mileage[[#This Row],[Mileage]]*H3)","v":0}]
[null,null,null,null,null,null,null,null,null,null,{"$f":"SUM(Mileage[[#This Row],[Mileage]]*H3)","v":0}]
[null,null,null,null,null,null,null,null,null,null,{"$f":"SUM(Mileage[[#This Row],[Mileage]]*H3)","v":0}]
[null,null,null,null,null,null,null,null,null,null,{"$f":"SUM(Mileage[[#This Row],[Mileage]]*H3)","v":0}]
[null,null,null,null,null,null,null,null,null,null,{"$f":"SUM(Mileage[[#This Row],[Mileage]]*H3)","v":0}]
[null,null,null,null,null,null,null,null,null,null,{"$f":"SUM(Mileage[[#This Row],[Mileage]]*H3)","v":0}]
[null,null,null,null,null,null,null,null,null,null,{"$f":"SUM(Mileage[[#This Row],[Mileage]]*H3)","v":0}]
[null,null,null,null,null,null,null,null,null,null,{"$f":"SUM(Mileage[[#This Row],[Mileage]]*H3)","v":0}]
[null,null,null,null,null,null,null,null,null,null,{"$f":"SUM(Mileage[[#This Row],[Mileage]]*H3)","v":0}]
[null,null,null,null,null,null,null,null,null,null,{"$f":"SUM(Mileage[[#This Row],[Mileage]]*H3)","v":0}]
[null,null,null,null,null,null,null,null,null,null,{"$f":"SUM(Mileage[[#This Row],[Mileage]]*H3)","v":0}]
[null,null,null,null,null,null,null,null,null,null,{"$f":"SUM(Mileage[[#This Row],[Mileage]]*H3)","v":0}]
[null,null,null,null,null,null,null,null,null,null,{"$f":"SUM(Mileage[[#This Row],[Mileage]]*H3)","v":0}]
[null,null,null,null,null,null,null,null,null,null,{"$f":"SUM(Mileage[[#This Row],[Mileage]]*H3)","v":0}]
[null,null,null,null,null,null,null,null,null,null,{"$f":"SUM(Mileage[[#This Row],[Mileage]]*H3)","v":0}]
[null,null,null,null,null,null,null,null,null,null,{"$f":"SUM(Mileage[[#This Row],[Mileage]]*H3)","v":0}]
[null,null,null,null,null,null,null,null,null,null,{"$f":"SUM(Mileage[[#This Row],[Mileage]]*H3)","v":0}]
[null,null,null,null,null,null,null,null,null,null,{"$f":"SUM(Mileage[[#This Row],[Mileage]]*H3)","v":0}]
[null,null,null,null,null,null,null,null,null,null,{"$f":"SUM(Mileage[[#This Row],[Mileage]]*H3)","v":0}]
[null,null,null,null,null,null,null,null,null,null,{"$f":"SUM(Mileage[[#This Row],[Mileage]]*H3)","v":0}]
[null,null,null,null,null,null,null,null,null,null,{"$f":"SUM(Mileage[[#This Row],[Mileage]]*H3)","v":0}]
[null,null,null,null,null,null,null,null,null,null,{"$f":"SUM(Mileage[[#This Row],[Mileage]]*H3)","v":0}]
[null,null,null,null,null,null,null,null,null,null,{"$f":"SUM(Mileage[[#This Row],[Mileage]]*H3)","v":0}]
[null,null,null,null,null,null,null,null,null,null,{"$f":"SUM(Mileage[[#This Row],[Mileage]]*H3)","v":0}]
[null,null,null,null,null,null,null,null,null,null,{"$f":"SUM(Mileage[[#This Row],[Mileage]]*H3)","v":0}]
[null,null,null,null,null,null,null,null,null,null,{"$f":"SUM(Mileage[[#This Row],[Mileage]]*H3)","v":0}]
[null,null,null,null,null,null,null,null,null,null,{"$f":"SUM(Mileage[[#This Row],[Mileage]]*H3)","v":0}]
[null,null,null,null,null,null,null,null,null,null,{"$f":"SUM(Mileage[[#This Row],[Mileage]]*H3)","v":0}]
[null,null,null,null,null,null,null,null,null,null,{"$f":"SUM(Mileage[[#This Row],[Mileage]]*H3)","v":0}]
[null,null,null,null,null,null,null,null,null,null,{"$f":"SUM(Mileage[[#This Row],[Mileage]]*H3)","v":0}]
[null,null,null,null,null,null,null,null,null,null,{"$f":"SUM(Mileage[[#This Row],[Mileage]]*H3)","v":0}]
[null,null,null,null,null,null,null,null,null,null,{"$f":"SUM(Mileage[[#This Row],[Mileage]]*H3)","v":0}]
[null,null,null,null,null,null,null,null,null,null,{"$f":"SUM(Mileage[[#This Row],[Mileage]]*H3)","v":0}]
[null,null,null,null,null,null,null,null,null,null,{"$f":"SUM(Mileage[[#This Row],[Mileage]]*H3)","v":0}]
[null,null,null,null,null,null,null,null,null,null,{"$f":"SUM(Mileage[[#This Row],[Mileage]]*H3)","v":0}]
[null,null,null,null,null,null,null,null,null,null,{"$f":"SUM(Mileage[[#This Row],[Mileage]]*H3)","v":0}]
[null,null,null,null,null,null,null,null,null,null,{"$f":"SUM(Mileage[[#This Row],[Mileage]]*H3)","v":0}]
[null,null,null,null,null,null,null,null,null,null,{"$f":"SUM(Mileage[[#This Row],[Mileage]]*H3)","v":0}]
[null,null,null,null,null,null,null,null,null,null,{"$f":"SUM(Mileage[[#This Row],[Mileage]]*H3)","v":0}]
[null,null,null,null,null,null,null,null,null,null,{"$f":"SUM(Mileage[[#This Row],[Mileage]]*H3)","v":0}]
[null,null,null,null,null,null,null,null,null,null,{"$f":"SUM(Mileage[[#This Row],[Mileage]]*H3)","v":0}]
[null,null,null,null,null,null,null,null,null,null,{"$f":"SUM(Mileage[[#This Row],[Mileage]]*H3)","v":0}]
[null,null,null,null,null,null,null,null,null,null,{"$f":"SUM(Mileage[[#This Row],[Mileage]]*H3)","v":0}]
[null,null,null,null,null,null,null,null,null,null,{"$f":"SUM(Mileage[[#This Row],[Mileage]]*H3)","v":0}]
[null,null,null,null,null,null,null,null,null,null,{"$f":"SUM(Mileage[[#This Row],[Mileage]]*H3)","v":0}]
[null,null,null,null,null,null,null,null,null,null,{"$f":"SUM(Mileage[[#This Row],[Mileage]]*H3)","v":0}]
[null,null,null,null,null,null,null,null,null,null,{"$f":"SUM(Mileage[[#This Row],[Mileage]]*H3)","v":0}]
[null,null,null,null,null,null,null,null,null,null,{"$f":"SUM(Mileage[[#This Row],[Mileage]]*H3)","v":0}]
[null,null,null,null,null,null,null,null,null,null,{"$f":"SUM(Mileage[[#This Row],[Mileage]]*H3)","v":0}]
[null,null,null,null,null,null,null,null,null,null,{"$f":"SUM(Mileage[[#This Row],[Mileage]]*H3)","v":0}]
[null,null,null,null,null,null,null,null,null,null,{"$f":"SUM(Mileage[[#This Row],[Mileage]]*H3)","v":0}]
[null,null,null,null,null,null,null,null,null,null,{"$f":"SUM(Mileage[[#This Row],[Mileage]]*H3)","v":0}]
[null,null,null,null,null,null,null,null,null,null,{"$f":"SUM(Mileage[[#This Row],[Mileage]]*H3)","v":0}]
[null,null,null,null,null,null,null,null,null,null,{"$f":"SUM(Mileage[[#This Row],[Mileage]]*H3)","v":0}]
[null,null,null,null,null,null,null,null,null,null,{"$f":"SUM(Mileage[[#This Row],[Mileage]]*H3)","v":0}]
[null,null,null,null,null,null,null,null,null,null,{"$f":"SUM(Mileage[[#This Row],[Mileage]]*H3)","v":0}]
[null,null,null,null,null,null,null,null,null,null,{"$f":"SUM(Mileage[[#This Row],[Mileage]]*H3)","v":0}]
[null,null,null,null,null,null,null,null,null,null,{"$f":"SUM(Mileage[[#This Row],[Mileage]]*H3)","v":0}]
[null,null,null,null,null,null,null,null,null,null,{"$f":"SUM(Mileage[[#This Row],[Mileage]]*H3)","v":0}]
[null,null,null,null,null,null,null,null,null,null,{"$f":"SUM(Mileage[[#This Row],[Mileage]]*H3)","v":0}]
[null,null,null,null,null,null,null,null,null,null,{"$f":"SUM(Mileage[[#This Row],[Mileage]]*H3)","v":0}]
[null,null,null,null,null,null,null,null,null,null,{"$f":"SUM(Mileage[[#This Row],[Mileage]]*H3)","v":0}]
[null,null,null,null,null,null,null,null,null,null,{"$f":"SUM(Mileage[[#This Row],[Mileage]]*H3)","v":0}]
[null,null,null,null,null,null,null,null,null,null,{"$f":"SUM(Mileage[[#This Row],[Mileage]]*H3)","v":0}]
[null,null,null,null,null,null,null,null,null,null,{"$f":"SUM(Mileage[[#This Row],[Mileage]]*H3)","v":0}]
[null,null,null,null,null,null,null,null,null,null,{"$f":"SUM(Mileage[[#This Row],[Mileage]]*H3)","v":0}]
[null,null,null,null,null,null,null,null,null,null,{"$f":"SUM(Mileage[[#This Row],[Mileage]]*H3)","v":0}]
[null,null,null,null,null,null,null,null,null,null,{"$f":"SUM(Mileage[[#This Row],[Mileage]]*H3)","v":0}]
[null,null,null,null,null,null,null,null,null,null,{"$f":"SUM(Mileage[[#This Row],[Mileage]]*H3)","v":0}]
[null,null,null,null,null,null,null,null,null,null,{"$f":"SUM(Mileage[[#This Row],[Mileage]]*H3)","v":0}]
[null,null,null,null,null,null,null,null,null,null,{"$f":"SUM(Mileage[[#This Row],[Mileage]]*H3)","v":0}]
[null,null,null,null,null,null,null,null,null,null,{"$f":"SUM(Mileage[[#This Row],[Mileage]]*H3)","v":0}]
[null,null,null,null,null,null,null,null,null,null,{"$f":"SUM(Mileage[[#This Row],[Mileage]]*H3)","v":0}]
[null,null,null,null,null,null,null,null,null,null,{"$f":"SUM(Mileage[[#This Row],[Mileage]]*H3)","v":0}]
[null,null,null,null,null,null,null,null,null,null,{"$f":"SUM(Mileage[[#This Row],[Mileage]]*H3)","v":0}]
[null,null,null,null,null,null,null,null,null,null,{"$f":"SUM(Mileage[[#This Row],[Mileage]]*H3)","v":0}]
[null,null,null,null,null,null,null,null,null,null,{"$f":"SUM(Mileage[[#This Row],[Mileage]]*H3)","v":0}]
[null,null,null,null,null,null,null,null,null,null,{"$f":"SUM(Mileage[[#This Row],[Mileage]]*H3)","v":0}]
[null,null,null,null,null,null,null,null,null,null,{"$f":"SUM(Mileage[[#This Row],[Mileage]]*H3)","v":0}]
[null,null,null,null,null,null,null,null,null,null,{"$f":"SUM(Mileage[[#This Row],[Mileage]]*H3)","v":0}]
[null,null,null,null,null,null,null,null,null,null,{"$f":"SUM(Mileage[[#This Row],[Mileage]]*H3)","v":0}]
[null,null,null,null,null,null,null,null,null,null,{"$f":"SUM(Mileage[[#This Row],[Mileage]]*H3)","v":0}]
[null,null,null,null,null,null,null,null,null,null,{"$f":"SUM(Mileage[[#This Row],[Mileage]]*H3)","v":0}]
[null,null,null,null,null,null,null,null,null,null,{"$f":"SUM(Mileage[[#This Row],[Mileage]]*H3)","v":0}]
[null,null,null,null,null,null,null,null,null,null,{"$f":"SUM(Mileage[[#This Row],[Mileage]]*H3)","v":0}]
[null,null,null,null,null,null,null,null,null,null,{"$f":"SUM(Mileage[[#This Row],[Mileage]]*H3)","v":0}]
[null,null,null,null,null,null,null,null,null,null,{"$f":"SUM(Mileage[[#This Row],[Mileage]]*H3)","v":0}]
[null,null,null,null,null,null,null,null,null,null,{"$f":"SUM(Mileage[[#This Row],[Mileage]]*H3)","v":0}]
[null,null,null,null,null,null,null,null,null,null,{"$f":"SUM(Mileage[[#This Row],[Mileage]]*H3)","v":0}]
[null,null,null,null,null,null,null,null,null,null,{"$f":"SUM(Mileage[[#This Row],[Mileage]]*H3)","v":0}]
[null,null,null,null,null,null,null,null,null,null,{"$f":"SUM(Mileage[[#This Row],[Mileage]]*H3)","v":0}]
[null,null,null,null,null,null,null,null,null,null,{"$f":"SUM(Mileage[[#This Row],[Mileage]]*H3)","v":0}]
[null,null,null,null,null,null,null,null,null,null,{"$f":"SUM(Mileage[[#This Row],[Mileage]]*H3)","v":0}]
[null,null,null,null,null,null,null,null,null,null,{"$f":"SUM(Mileage[[#This Row],[Mileage]]*H3)","v":0}]
[null,null,null,null,null,null,null,null,null,null,{"$f":"SUM(Mileage[[#This Row],[Mileage]]*H3)","v":0}]
[null,null,null,null,null,null,null,null,null,null,{"$f":"SUM(Mileage[[#This Row],[Mileage]]*H3)","v":0}]
[null,null,null,null,null,null,null,null,null,null,{"$f":"SUM(Mileage[[#This Row],[Mileage]]*H3)","v":0}]
[null,null,null,null,null,null,null,null,null,null,{"$f":"SUM(Mileage[[#This Row],[Mileage]]*H3)","v":0}]
[null,null,null,null,null,null,null,null,null,null,{"$f":"SUM(Mileage[[#This Row],[Mileage]]*H3)","v":0}]
[null,null,null,null,null,null,null,null,null,null,{"$f":"SUM(Mileage[[#This Row],[Mileage]]*H3)","v":0}]
[null,null,null,null,null,null,null,null,null,null,{"$f":"SUM(Mileage[[#This Row],[Mileage]]*H3)","v":0}]
[null,null,null,null,null,null,null,null,null,null,{"$f":"SUM(Mileage[[#This Row],[Mileage]]*H3)","v":0}]
[null,null,null,null,null,null,null,null,null,null,{"$f":"SUM(Mileage[[#This Row],[Mileage]]*H3)","v":0}]
[null,null,null,null,null,null,null,null,null,null,{"$f":"SUM(Mileage[[#This Row],[Mileage]]*H3)","v":0}]
[null,null,null,null,null,null,null,null,null,null,{"$f":"SUM(Mileage[[#This Row],[Mileage]]*H3)","v":0}]
[null,null,null,null,null,null,null,null,null,null,{"$f":"SUM(Mileage[[#This Row],[Mileage]]*H3)","v":0}]
[null,null,null,null,null,null,null,null,null,null,{"$f":"SUM(Mileage[[#This Row],[Mileage]]*H3)","v":0}]
[null,null,null,null,null,null,null,null,null,null,{"$f":"SUM(Mileage[[#This Row],[Mileage]]*H3)","v":0}]
[null,null,null,null,null,null,null,null,null,null,{"$f":"SUM(Mileage[[#This Row],[Mileage]]*H3)","v":0}]
[null,null,null,null,null,null,null,null,null,null,{"$f":"SUM(Mileage[[#This Row],[Mileage]]*H3)","v":0}]
[null,null,null,null,null,null,null,null,null,null,{"$f":"SUM(Mileage[[#This Row],[Mileage]]*H3)","v":0}]
[null,null,null,null,null,null,null,null,null,null,{"$f":"SUM(Mileage[[#This Row],[Mileage]]*H3)","v":0}]
[null,null,null,null,null,null,null,null,null,null,{"$f":"SUM(Mileage[[#This Row],[Mileage]]*H3)","v":0}]
[null,null,null,null,null,null,null,null,null,null,{"$f":"SUM(Mileage[[#This Row],[Mileage]]*H3)","v":0}]
[null,null,null,null,null,null,null,null,null,null,{"$f":"SUM(Mileage[[#This Row],[Mileage]]*H3)","v":0}]
[null,null,null,null,null,null,null,null,null,null,{"$f":"SUM(Mileage[[#This Row],[Mileage]]*H3)","v":0}]
[null,null,null,null,null,null,null,null,null,null,{"$f":"SUM(Mileage[[#This Row],[Mileage]]*H3)","v":0}]
[null,null,null,null,null,null,null,null,null,null,{"$f":"SUM(Mileage[[#This Row],[Mileage]]*H3)","v":0}]
[null,null,null,null,null,null,null,null,null,null,{"$f":"SUM(Mileage[[#This Row],[Mileage]]*H3)","v":0}]
[null,null,null,null,null,null,null,null,null,null,{"$f":"SUM(Mileage[[#This Row],[Mileage]]*H3)","v":0}]
[null,null,null,null,null,null,null,null,null,null,{"$f":"SUM(Mileage[[#This Row],[Mileage]]*H3)","v":0}]
[null,null,null,null,null,null,null,null,null,null,{"$f":"SUM(Mileage[[#This Row],[Mileage]]*H3)","v":0}]
[null,null,null,null,null,null,null,null,null,null,{"$f":"SUM(Mileage[[#This Row],[Mileage]]*H3)","v":0}]
[null,null,null,null,null,null,null,null,null,null,{"$f":"SUM(Mileage[[#This Row],[Mileage]]*H3)","v":0}]
[null,null,null,null,null,null,null,null,null,null,{"$f":"SUM(Mileage[[#This Row],[Mileage]]*H3)","v":0}]
[null,null,null,null,null,null,null,null,null,null,{"$f":"SUM(Mileage[[#This Row],[Mileage]]*H3)","v":0}]
[null,null,null,null,null,null,null,null,null,null,{"$f":"SUM(Mileage[[#This Row],[Mileage]]*H3)","v":0}]
[null,null,null,null,null,null,null,null,null,null,{"$f":"SUM(Mileage[[#This Row],[Mileage]]*H3)","v":0}]
[null,null,null,null,null,null,null,null,null,null,{"$f":"SUM(Mileage[[#This Row],[Mileage]]*H3)","v":0}]
[null,null,null,null,null,null,null,null,null,null,{"$f":"SUM(Mileage[[#This Row],[Mileage]]*H3)","v":0}]
[null,null,null,null,null,null,null,null,null,null,{"$f":"SUM(Mileage[[#This Row],[Mileage]]*H3)","v":0}]
[null,null,null,null,null,null,null,null,null,null,{"$f":"SUM(Mileage[[#This Row],[Mileage]]*H3)","v":0}]
[null,null,null,null,null,null,null,null,null,null,{"$f":"SUM(Mileage[[#This Row],[Mileage]]*H3)","v":0}]
[null,null,null,null,null,null,null,null,null,null,{"$f":"SUM(Mileage[[#This Row],[Mileage]]*H3)","v":0}]
[null,null,null,null,null,null,null,null,null,null,{"$f":"SUM(Mileage[[#This Row],[Mileage]]*H3)","v":0}]
[null,null,null,null,null,null,null,null,null,null,{"$f":"SUM(Mileage[[#This Row],[Mileage]]*H3)","v":0}]
[null,null,null,null,null,null,null,null,null,null,{"$f":"SUM(Mileage[[#This Row],[Mileage]]*H3)","v":0}]
[null,null,null,null,null,null,null,null,null,null,{"$f":"SUM(Mileage[[#This Row],[Mileage]]*H3)","v":0}]
[null,null,null,null,null,null,null,null,null,null,{"$f":"SUM(Mileage[[#This Row],[Mileage]]*H3)","v":0}]
[null,null,null,null,null,null,null,null,null,null,{"$f":"SUM(Mileage[[#This Row],[Mileage]]*H3)","v":0}]
[null,null,null,null,null,null,null,null,null,null,{"$f":"SUM(Mileage[[#This Row],[Mileage]]*H3)","v":0}]
[null,null,null,null,null,null,null,null,null,null,{"$f":"SUM(Mileage[[#This Row],[Mileage]]*H3)","v":0}]
[null,null,null,null,null,null,null,null,null,null,{"$f":"SUM(Mileage[[#This Row],[Mileage]]*H3)","v":0}]
[null,null,null,null,null,null,null,null,null,null,{"$f":"SUM(Mileage[[#This Row],[Mileage]]*H3)","v":0}]
[null,null,null,null,null,null,null,null,null,null,{"$f":"SUM(Mileage[[#This Row],[Mileage]]*H3)","v":0}]
[null,null,null,null,null,null,null,null,null,null,{"$f":"SUM(Mileage[[#This Row],[Mileage]]*H3)","v":0}]
[null,null,null,null,null,null,null,null,null,null,{"$f":"SUM(Mileage[[#This Row],[Mileage]]*H3)","v":0}]
[null,null,null,null,null,null,null,null,null,null,{"$f":"SUM(Mileage[[#This Row],[Mileage]]*H3)","v":0}]
[null,null,null,null,null,null,null,null,null,null,{"$f":"SUM(Mileage[[#This Row],[Mileage]]*H3)","v":0}]
[null,null,null,null,null,null,null,null,null,null,{"$f":"SUM(Mileage[[#This Row],[Mileage]]*H3)","v":0}]
[null,null,null,null,null,null,null,null,null,null,{"$f":"SUM(Mileage[[#This Row],[Mileage]]*H3)","v":0}]
[null,null,null,null,null,null,null,null,null,null,{"$f":"SUM(Mileage[[#This Row],[Mileage]]*H3)","v":0}]
[null,null,null,null,null,null,null,null,null,null,{"$f":"SUM(Mileage[[#This Row],[Mileage]]*H3)","v":0}]
[null,null,null,null,null,null,null,null,null,null,{"$f":"SUM(Mileage[[#This Row],[Mileage]]*H3)","v":0}]
[null,null,null,null,null,null,null,null,null,null,{"$f":"SUM(Mileage[[#This Row],[Mileage]]*H3)","v":0}]
[null,null,null,null,null,null,null,null,null,null,{"$f":"SUM(Mileage[[#This Row],[Mileage]]*H3)","v":0}]
[null,null,null,null,null,null,null,null,null,null,{"$f":"SUM(Mileage[[#This Row],[Mileage]]*H3)","v":0}]
[null,null,null,null,null,null,null,null,null,null,{"$f":"SUM(Mileage[[#This Row],[Mileage]]*H3)","v":0}]
[null,null,null,null,null,null,null,null,null,null,{"$f":"SUM(Mileage[[#This Row],[Mileage]]*H3)","v":0}]
[null,null,null,null,null,null,null,null,null,null,{"$f":"SUM(Mileage[[#This Row],[Mileage]]*H3)","v":0}]
[null,null,null,null,null,null,null,null,null,null,{"$f":"SUM(Mileage[[#This Row],[Mileage]]*H3)","v":0}]
[null,null,null,null,null,null,null,null,null,null,{"$f":"SUM(Mileage[[#This Row],[Mileage]]*H3)","v":0}]
[null,null,null,null,null,null,null,null,null,null,{"$f":"SUM(Mileage[[#This Row],[Mileage]]*H3)","v":0}]
[null,null,null,null,null,null,null,null,null,null,{"$f":"SUM(Mileage[[#This Row],[Mileage]]*H3)","v":0}]
[null,null,null,null,null,null,null,null,null,null,{"$f":"SUM(Mileage[[#This Row],[Mileage]]*H3)","v":0}]
[null,null,null,null,null,null,null,null,null,null,{"$f":"SUM(Mileage[[#This Row],[Mileage]]*H3)","v":0}]
[null,null,null,null,null,null,null,null,null,null,{"$f":"SUM(Mileage[[#This Row],[Mileage]]*H3)","v":0}]
[null,null,null,null,null,null,null,null,null,null,{"$f":"SUM(Mileage[[#This Row],[Mileage]]*H3)","v":0}]
[null,null,null,null,null,null,null,null,null,null,{"$f":"SUM(Mileage[[#This Row],[Mileage]]*H3)","v":0}]
[null,null,null,null,null,null,null,null,null,null,{"$f":"SUM(Mileage[[#This Row],[Mileage]]*H3)","v":0}]
[null,null,null,null,null,null,null,null,null,null,{"$f":"SUM(Mileage[[#This Row],[Mileage]]*H3)","v":0}]
[null,null,null,null,null,null,null,null,null,null,{"$f":"SUM(Mileage[[#This Row],[Mileage]]*H3)","v":0}]
[null,null,null,null,null,null,null,null,null,null,{"$f":"SUM(Mileage[[#This Row],[Mileage]]*H3)","v":0}]
[null,null,null,null,null,null,null,null,null,null,{"$f":"SUM(Mileage[[#This Row],[Mileage]]*H3)","v":0}]
[null,null,null,null,null,null,null,null,null,null,{"$f":"SUM(Mileage[[#This Row],[Mileage]]*H3)","v":0}]
[null,null,null,null,null,null,null,null,null,null,{"$f":"SUM(Mileage[[#This Row],[Mileage]]*H3)","v":0}]
[null,null,null,null,null,null,null,null,null,null,{"$f":"SUM(Mileage[[#This Row],[Mileage]]*H3)","v":0}]
[null,null,null,null,null,null,null,null,null,null,{"$f":"SUM(Mileage[[#This Row],[Mileage]]*H3)","v":0}]
[null,null,null,null,null,null,null,null,null,null,{"$f":"SUM(Mileage[[#This Row],[Mileage]]*H3)","v":0}]
[null,null,null,null,null,null,null,null,null,null,{"$f":"SUM(Mileage[[#This Row],[Mileage]]*H3)","v":0}]
{"$rows_left_out":102}
{"sheet":"Dropdown","index":2,"n_rows":3,"n_cols":1,"rows_kept":3,"cut":false,"hidden":true,"merged":[]}
["Expense Item Classification"]
["Official Business"]
["External Training"]